{"text_format":"2","workbook":"xlsx","n_sheets":3,"sheets":["Sheet1","Sheet2","Sheet3"],"not_rendered":{"charts":0,"images":0,"macros":0,"external_links":1,"defined_names":0,"comments":0,"pivot_tables":0},"unopened":[],"bounds":{"document_bytes":16777216,"sheet_cells":100000,"run_cost":"one","rows_first":2000,"rows_last":500,"rows_between":2000,"halvings":0,"cell_chars":16384,"cell_head_chars":4096},"cells_cut":0,"cells_raw":0,"read":"whole","date_system":"1900"}

{"sheet":"Sheet1","index":0,"n_rows":626,"n_cols":27,"rows_kept":626,"cut":false,"hidden":false,"merged":[]}
[" id","新开账状态"," 新收款状态"," 对应合同编号"," 账单名称"," 企业名称","匹配企业"," 联系人"," 联系电话"," 对应合同编号","对应载体"," 费用类型"," 归属账期"," 账单名称"," 账单金额（元）"," 账单到期日"," 应收调整金额（元）"," 调整后账单金额（元）"," 开账状态","新开账状态"," 开账操作人"," 开账操作时间"," 是否已申请坏账红冲"," 开票状态"," 收款状态"," 账单逾期天数"," id"]
["q6e6Bsovw5C2tXnBfKj","已开账","不收款","C2023326","入驻款（物业费）","艾普柯微电子（江苏）有限公司",{"$f":"VLOOKUP(F2,[1]用友原始数据!B$1:B$65536,1,0)","v":"艾普柯微电子（江苏）有限公司"},"李碧洲","18621367698","C2023326","中国物联网国际创新园/三期/G8栋/501","物业费","2021年01月01日~2021年04月01日","入驻款（物业费）",21558.6,"",0,21558.6,"待开账","已开账",null,"","否",null,null,"","q6e6Bsovw5C2tXnBfKj"]
["gIShwVcBVNFqkfS32G4","已开账","不收款","C2023326","2021年04月01日~2021年07月01日 物业费","艾普柯微电子（江苏）有限公司",{"$f":"VLOOKUP(F3,[1]用友原始数据!B$1:B$65536,1,0)","v":"艾普柯微电子（江苏）有限公司"},"李碧洲","18621367698","C2023326","中国物联网国际创新园/三期/G8栋/501","物业费","2021年04月01日~2021年07月01日","2021年04月01日~2021年07月01日 物业费",21558.6,"2021-03-24",0,21558.6,"待开账","已开账",null,"","否",null,null,"873","gIShwVcBVNFqkfS32G4"]
["8zCtBQnW4ISxC1l1iIo","已开账","不收款","C2023326","2021年07月01日~2021年10月01日 物业费","艾普柯微电子（江苏）有限公司",{"$f":"VLOOKUP(F4,[1]用友原始数据!B$1:B$65536,1,0)","v":"艾普柯微电子（江苏）有限公司"},"李碧洲","18621367698","C2023326","中国物联网国际创新园/三期/G8栋/501","物业费","2021年07月01日~2021年10月01日","2021年07月01日~2021年10月01日 物业费",21558.6,"2021-06-23",0,21558.6,"待开账","已开账",null,"","否",null,null,"782","8zCtBQnW4ISxC1l1iIo"]
["C3KTNG80aaNVTjWFcKp","已开账","不收款","C2023326","2021年10月01日~2022年01月01日 物业费","艾普柯微电子（江苏）有限公司",{"$f":"VLOOKUP(F5,[1]用友原始数据!B$1:B$65536,1,0)","v":"艾普柯微电子（江苏）有限公司"},"李碧洲","18621367698","C2023326","中国物联网国际创新园/三期/G8栋/501","物业费","2021年10月01日~2022年01月01日","2021年10月01日~2022年01月01日 物业费",21558.6,"2021-09-23",0,21558.6,"待开账","已开账",null,"","否",null,null,"690","C3KTNG80aaNVTjWFcKp"]
["idTlQ5j6co914qAxInd","已开账","不收款","C2023326","2022年01月01日~2022年04月01日 物业费","艾普柯微电子（江苏）有限公司",{"$f":"VLOOKUP(F6,[1]用友原始数据!B$1:B$65536,1,0)","v":"艾普柯微电子（江苏）有限公司"},"李碧洲","18621367698","C2023326","中国物联网国际创新园/三期/G8栋/501","物业费","2022年01月01日~2022年04月01日","2022年01月01日~2022年04月01日 物业费",21558.6,"2021-12-24",0,21558.6,"待开账","已开账",null,"","否",null,null,"598","idTlQ5j6co914qAxInd"]
["Y96atotuGHN78PsNTTG","已开账","不收款","C2023326","2022年04月01日~2022年07月01日 物业费","艾普柯微电子（江苏）有限公司",{"$f":"VLOOKUP(F7,[1]用友原始数据!B$1:B$65536,1,0)","v":"艾普柯微电子（江苏）有限公司"},"李碧洲","18621367698","C2023326","中国物联网国际创新园/三期/G8栋/501","物业费","2022年04月01日~2022年07月01日","2022年04月01日~2022年07月01日 物业费",21558.6,"2022-03-24",0,21558.6,"待开账","已开账",null,"","否",null,null,"508","Y96atotuGHN78PsNTTG"]
["fw9DbmUnZJO8WsVSjcQ","已开账","不收款","C2023326","2022年07月01日~2022年10月01日 物业费","艾普柯微电子（江苏）有限公司",{"$f":"VLOOKUP(F8,[1]用友原始数据!B$1:B$65536,1,0)","v":"艾普柯微电子（江苏）有限公司"},"李碧洲","18621367698","C2023326","中国物联网国际创新园/三期/G8栋/501","物业费","2022年07月01日~2022年10月01日","2022年07月01日~2022年10月01日 物业费",21558.6,"2022-06-23",0,21558.6,"待开账","已开账",null,"","否",null,null,"417","fw9DbmUnZJO8WsVSjcQ"]
["4pW3WqUrB0oTraj7Its","已开账","不收款","C2023326","2022年10月01日~2023年01月01日 物业费","艾普柯微电子（江苏）有限公司",{"$f":"VLOOKUP(F9,[1]用友原始数据!B$1:B$65536,1,0)","v":"艾普柯微电子（江苏）有限公司"},"李碧洲","18621367698","C2023326","中国物联网国际创新园/三期/G8栋/501","物业费","2022年10月01日~2023年01月01日","2022年10月01日~2023年01月01日 物业费",21558.6,"2022-09-23",0,21558.6,"待开账","已开账",null,"","否",null,null,"325","4pW3WqUrB0oTraj7Its"]
["bYcGURPLjMXwzYU2HX7","已开账","不收款","C2023326","2023年01月01日~2023年04月01日 物业费","艾普柯微电子（江苏）有限公司",{"$f":"VLOOKUP(F10,[1]用友原始数据!B$1:B$65536,1,0)","v":"艾普柯微电子（江苏）有限公司"},"李碧洲","18621367698","C2023326","中国物联网国际创新园/三期/G8栋/501","物业费","2023年01月01日~2023年04月01日","2023年01月01日~2023年04月01日 物业费",21558.6,"2022-12-24",0,21558.6,"待开账","已开账",null,"","否",null,null,"233","bYcGURPLjMXwzYU2HX7"]
["sAgF5vtNmj8CoMXUlYJ","已开账","不收款","C2023326","入驻款（租金）","艾普柯微电子（江苏）有限公司",{"$f":"VLOOKUP(F11,[1]用友原始数据!B$1:B$65536,1,0)","v":"艾普柯微电子（江苏）有限公司"},"李碧洲","18621367698","C2023326","中国物联网国际创新园/三期/G8栋/501","租金","2021年01月01日~2021年04月01日","入驻款（租金）",129351.6,"",0,129351.6,"待开账","已开账",null,"","否",null,null,"","sAgF5vtNmj8CoMXUlYJ"]
["O3bBQvE48GYPnzLkKsD","已开账","不收款","C2023326","2021年04月01日~2021年07月01日 租金","艾普柯微电子（江苏）有限公司",{"$f":"VLOOKUP(F12,[1]用友原始数据!B$1:B$65536,1,0)","v":"艾普柯微电子（江苏）有限公司"},"李碧洲","18621367698","C2023326","中国物联网国际创新园/三期/G8栋/501","租金","2021年04月01日~2021年07月01日","2021年04月01日~2021年07月01日 租金",129351.6,"2021-03-24",0,129351.6,"待开账","已开账",null,"","否",null,null,"873","O3bBQvE48GYPnzLkKsD"]
["MDZuxd8x5ucYMKYYQeG","已开账","不收款","C2023326","2021年07月01日~2021年10月01日 租金","艾普柯微电子（江苏）有限公司",{"$f":"VLOOKUP(F13,[1]用友原始数据!B$1:B$65536,1,0)","v":"艾普柯微电子（江苏）有限公司"},"李碧洲","18621367698","C2023326","中国物联网国际创新园/三期/G8栋/501","租金","2021年07月01日~2021年10月01日","2021年07月01日~2021年10月01日 租金",129351.6,"2021-06-23",0,129351.6,"待开账","已开账",null,"","否",null,null,"782","MDZuxd8x5ucYMKYYQeG"]
["zGJVsIUIZJuv5Ggma5c","已开账","不收款","C2023326","2021年10月01日~2022年01月01日 租金","艾普柯微电子（江苏）有限公司",{"$f":"VLOOKUP(F14,[1]用友原始数据!B$1:B$65536,1,0)","v":"艾普柯微电子（江苏）有限公司"},"李碧洲","18621367698","C2023326","中国物联网国际创新园/三期/G8栋/501","租金","2021年10月01日~2022年01月01日","2021年10月01日~2022年01月01日 租金",129351.6,"2021-09-23",0,129351.6,"待开账","已开账",null,"","否",null,null,"690","zGJVsIUIZJuv5Ggma5c"]
["pNPyxpdFXBrCONsebE1","已开账","不收款","C2023326","2022年01月01日~2022年04月01日 租金","艾普柯微电子（江苏）有限公司",{"$f":"VLOOKUP(F15,[1]用友原始数据!B$1:B$65536,1,0)","v":"艾普柯微电子（江苏）有限公司"},"李碧洲","18621367698","C2023326","中国物联网国际创新园/三期/G8栋/501","租金","2022年01月01日~2022年04月01日","2022年01月01日~2022年04月01日 租金",129351.6,"2021-12-24",0,129351.6,"待开账","已开账",null,"","否",null,null,"598","pNPyxpdFXBrCONsebE1"]
["hZk2Rps0U9XCDqzmBz6","已开账","不收款","C2023326","2022年04月01日~2022年07月01日 租金","艾普柯微电子（江苏）有限公司",{"$f":"VLOOKUP(F16,[1]用友原始数据!B$1:B$65536,1,0)","v":"艾普柯微电子（江苏）有限公司"},"李碧洲","18621367698","C2023326","中国物联网国际创新园/三期/G8栋/501","租金","2022年04月01日~2022年07月01日","2022年04月01日~2022年07月01日 租金",129351.6,"2022-03-24",0,129351.6,"待开账","已开账",null,"","否",null,null,"508","hZk2Rps0U9XCDqzmBz6"]
["aIzI6NtgiS20m8vqh3c","已开账","不收款","C2023326","2022年07月01日~2022年10月01日 租金","艾普柯微电子（江苏）有限公司",{"$f":"VLOOKUP(F17,[1]用友原始数据!B$1:B$65536,1,0)","v":"艾普柯微电子（江苏）有限公司"},"李碧洲","18621367698","C2023326","中国物联网国际创新园/三期/G8栋/501","租金","2022年07月01日~2022年10月01日","2022年07月01日~2022年10月01日 租金",129351.6,"2022-06-23",0,129351.6,"待开账","已开账",null,"","否",null,null,"417","aIzI6NtgiS20m8vqh3c"]
["E5cOZOeEmy2fLMG0x7Q","已开账","不收款","C2023326","2022年10月01日~2023年01月01日 租金","艾普柯微电子（江苏）有限公司",{"$f":"VLOOKUP(F18,[1]用友原始数据!B$1:B$65536,1,0)","v":"艾普柯微电子（江苏）有限公司"},"李碧洲","18621367698","C2023326","中国物联网国际创新园/三期/G8栋/501","租金","2022年10月01日~2023年01月01日","2022年10月01日~2023年01月01日 租金",129351.6,"2022-09-23",0,129351.6,"待开账","已开账",null,"","否",null,null,"325","E5cOZOeEmy2fLMG0x7Q"]
["5eqpLZgIJ2jJfI38XA1","已开账","不收款","C2023326","2023年01月01日~2023年04月01日 租金","艾普柯微电子（江苏）有限公司",{"$f":"VLOOKUP(F19,[1]用友原始数据!B$1:B$65536,1,0)","v":"艾普柯微电子（江苏）有限公司"},"李碧洲","18621367698","C2023326","中国物联网国际创新园/三期/G8栋/501","租金","2023年01月01日~2023年04月01日","2023年01月01日~2023年04月01日 租金",129351.6,"2022-12-24",0,129351.6,"待开账","已开账",null,"","否",null,null,"233","5eqpLZgIJ2jJfI38XA1"]
["9pZ7t85RKjmi3Bfz8kx","已开账","不收款","C2023314","入驻款（物业费）","华合仁（江苏）科技发展有限公司",{"$f":"VLOOKUP(F20,[1]用友原始数据!B$1:B$65536,1,0)","v":"华合仁（江苏）科技发展有限公司"},"肖新影","18803278987","C2023314","中国物联网国际创新园/三期/G10栋/1003","物业费","2022年05月01日~2022年08月01日","入驻款（物业费）",3637.2,"",0,3637.2,"待开账","已开账",null,"","否",null,null,"","9pZ7t85RKjmi3Bfz8kx"]
["lqa9WjxMlxriWsVJkal","已开账","不收款","C2023314","2022年08月01日~2022年11月01日 物业费","华合仁（江苏）科技发展有限公司",{"$f":"VLOOKUP(F21,[1]用友原始数据!B$1:B$65536,1,0)","v":"华合仁（江苏）科技发展有限公司"},"肖新影","18803278987","C2023314","中国物联网国际创新园/三期/G10栋/1003","物业费","2022年08月01日~2022年11月01日","2022年08月01日~2022年11月01日 物业费",3637.2,"2022-07-24",0,3637.2,"待开账","已开账",null,"","否",null,null,"386","lqa9WjxMlxriWsVJkal"]
["5kYcfpWkvu3hOshPdvo","已开账","不收款","C2023314","2022年11月01日~2023年02月01日 物业费","华合仁（江苏）科技发展有限公司",{"$f":"VLOOKUP(F22,[1]用友原始数据!B$1:B$65536,1,0)","v":"华合仁（江苏）科技发展有限公司"},"肖新影","18803278987","C2023314","中国物联网国际创新园/三期/G10栋/1003","物业费","2022年11月01日~2023年02月01日","2022年11月01日~2023年02月01日 物业费",3637.2,"2022-10-24",0,3637.2,"待开账","已开账",null,"","否",null,null,"294","5kYcfpWkvu3hOshPdvo"]
["w8ffczp3yTaNpGqaxaw","已开账","不收款","C2023314","2023年02月01日~2023年05月01日 物业费","华合仁（江苏）科技发展有限公司",{"$f":"VLOOKUP(F23,[1]用友原始数据!B$1:B$65536,1,0)","v":"华合仁（江苏）科技发展有限公司"},"肖新影","18803278987","C2023314","中国物联网国际创新园/三期/G10栋/1003","物业费","2023年02月01日~2023年05月01日","2023年02月01日~2023年05月01日 物业费",3637.2,"2023-01-24",0,3637.2,"待开账","已开账",null,"","否",null,null,"202","w8ffczp3yTaNpGqaxaw"]
["9LCLSWPABQ0oTi4X2JR","已开账","不收款","C2023314","入驻款（租金）","华合仁（江苏）科技发展有限公司",{"$f":"VLOOKUP(F24,[1]用友原始数据!B$1:B$65536,1,0)","v":"华合仁（江苏）科技发展有限公司"},"肖新影","18803278987","C2023314","中国物联网国际创新园/三期/G10栋/1003","租金","2022年05月01日~2022年08月01日","入驻款（租金）",18186,"",0,18186,"待开账","已开账",null,"","否",null,null,"","9LCLSWPABQ0oTi4X2JR"]
["yzsR4BY05g6baTHq989","已开账","不收款","C2023314","2022年08月01日~2022年11月01日 租金","华合仁（江苏）科技发展有限公司",{"$f":"VLOOKUP(F25,[1]用友原始数据!B$1:B$65536,1,0)","v":"华合仁（江苏）科技发展有限公司"},"肖新影","18803278987","C2023314","中国物联网国际创新园/三期/G10栋/1003","租金","2022年08月01日~2022年11月01日","2022年08月01日~2022年11月01日 租金",18186,"2022-07-24",0,18186,"待开账","已开账",null,"","否",null,null,"386","yzsR4BY05g6baTHq989"]
["lgUHEmmMy1GIEsm9f7P","已开账","不收款","C2023314","2022年11月01日~2023年02月01日 租金","华合仁（江苏）科技发展有限公司",{"$f":"VLOOKUP(F26,[1]用友原始数据!B$1:B$65536,1,0)","v":"华合仁（江苏）科技发展有限公司"},"肖新影","18803278987","C2023314","中国物联网国际创新园/三期/G10栋/1003","租金","2022年11月01日~2023年02月01日","2022年11月01日~2023年02月01日 租金",18186,"2022-10-24",0,18186,"待开账","已开账",null,"","否",null,null,"294","lgUHEmmMy1GIEsm9f7P"]
["AXkr7ypRpcJEr6vL0lM","已开账","不收款","C2023314","2023年02月01日~2023年05月01日 租金","华合仁（江苏）科技发展有限公司",{"$f":"VLOOKUP(F27,[1]用友原始数据!B$1:B$65536,1,0)","v":"华合仁（江苏）科技发展有限公司"},"肖新影","18803278987","C2023314","中国物联网国际创新园/三期/G10栋/1003","租金","2023年02月01日~2023年05月01日","2023年02月01日~2023年05月01日 租金",18186,"2023-01-24",0,18186,"待开账","已开账",null,"","否",null,null,"202","AXkr7ypRpcJEr6vL0lM"]
["1YxO5TTjJ94aKWRB3qq","已开账","不收款","C2023247","入驻款（物业费）","江苏奥立信数字科技有限公司",{"$f":"VLOOKUP(F28,[1]用友原始数据!B$1:B$65536,1,0)","v":"江苏奥立信数字科技有限公司"},"曾庆斌","18605314315","C2023247","中国物联网国际创新园/三期/G1栋/306","物业费","2021年06月01日~2021年09月01日","入驻款（物业费）",11400.9,"",0,11400.9,"待开账","已开账",null,"","否",null,null,"","1YxO5TTjJ94aKWRB3qq"]
["EJwfJzajzEZKPHryx98","已开账","不收款","C2023247","2021年09月01日~2021年12月01日 物业费","江苏奥立信数字科技有限公司",{"$f":"VLOOKUP(F29,[1]用友原始数据!B$1:B$65536,1,0)","v":"江苏奥立信数字科技有限公司"},"曾庆斌","18605314315","C2023247","中国物联网国际创新园/三期/G1栋/306","物业费","2021年09月01日~2021年12月01日","2021年09月01日~2021年12月01日 物业费",11400.9,"2021-08-24",0,11400.9,"待开账","已开账",null,"","否",null,null,"720","EJwfJzajzEZKPHryx98"]
["iZS45whgGVZkC7OhXSB","已开账","不收款","C2023247","2021年12月01日~2022年03月01日 物业费","江苏奥立信数字科技有限公司",{"$f":"VLOOKUP(F30,[1]用友原始数据!B$1:B$65536,1,0)","v":"江苏奥立信数字科技有限公司"},"曾庆斌","18605314315","C2023247","中国物联网国际创新园/三期/G1栋/306","物业费","2021年12月01日~2022年03月01日","2021年12月01日~2022年03月01日 物业费",11400.9,"2021-11-23",0,11400.9,"待开账","已开账",null,"","否",null,null,"629","iZS45whgGVZkC7OhXSB"]
["OlUUgv7H5Jr6EIJ5mDY","已开账","不收款","C2023247","2022年03月01日~2022年06月01日 物业费","江苏奥立信数字科技有限公司",{"$f":"VLOOKUP(F31,[1]用友原始数据!B$1:B$65536,1,0)","v":"江苏奥立信数字科技有限公司"},"曾庆斌","18605314315","C2023247","中国物联网国际创新园/三期/G1栋/306","物业费","2022年03月01日~2022年06月01日","2022年03月01日~2022年06月01日 物业费",11400.9,"2022-02-21",0,11400.9,"待开账","已开账",null,"","否",null,null,"539","OlUUgv7H5Jr6EIJ5mDY"]
["Y1Clm28f1KQdJdcUW37","已开账","不收款","C2023247","2022年06月01日~2022年09月01日 物业费","江苏奥立信数字科技有限公司",{"$f":"VLOOKUP(F32,[1]用友原始数据!B$1:B$65536,1,0)","v":"江苏奥立信数字科技有限公司"},"曾庆斌","18605314315","C2023247","中国物联网国际创新园/三期/G1栋/306","物业费","2022年06月01日~2022年09月01日","2022年06月01日~2022年09月01日 物业费",11400.9,"2022-05-24",0,11400.9,"待开账","已开账",null,"","否",null,null,"447","Y1Clm28f1KQdJdcUW37"]
["wW9EcoTlEhOm7vwjOCd","已开账","不收款","C2023247","2022年09月01日~2022年12月01日 物业费","江苏奥立信数字科技有限公司",{"$f":"VLOOKUP(F33,[1]用友原始数据!B$1:B$65536,1,0)","v":"江苏奥立信数字科技有限公司"},"曾庆斌","18605314315","C2023247","中国物联网国际创新园/三期/G1栋/306","物业费","2022年09月01日~2022年12月01日","2022年09月01日~2022年12月01日 物业费",11400.9,"2022-08-24",0,11400.9,"待开账","已开账",null,"","否",null,null,"355","wW9EcoTlEhOm7vwjOCd"]
["mSLTz2qlb4ooa20i963","已开账","不收款","C2023247","2022年12月01日~2023年03月01日 物业费","江苏奥立信数字科技有限公司",{"$f":"VLOOKUP(F34,[1]用友原始数据!B$1:B$65536,1,0)","v":"江苏奥立信数字科技有限公司"},"曾庆斌","18605314315","C2023247","中国物联网国际创新园/三期/G1栋/306","物业费","2022年12月01日~2023年03月01日","2022年12月01日~2023年03月01日 物业费",11400.9,"2022-11-23",0,11400.9,"待开账","已开账",null,"","否",null,null,"264","mSLTz2qlb4ooa20i963"]
["7SKsobB4PZXciArLDWB","已开账","不收款","C2023247","2023年03月01日~2023年06月01日 物业费","江苏奥立信数字科技有限公司",{"$f":"VLOOKUP(F35,[1]用友原始数据!B$1:B$65536,1,0)","v":"江苏奥立信数字科技有限公司"},"曾庆斌","18605314315","C2023247","中国物联网国际创新园/三期/G1栋/306","物业费","2023年03月01日~2023年06月01日","2023年03月01日~2023年06月01日 物业费",11400.9,"2023-02-21",0,11400.9,"待开账","已开账",null,"","否",null,null,"174","7SKsobB4PZXciArLDWB"]
["hqGF1z8iFNwyJRuJwWb","已开账","不收款","C2023247","入驻款（租金）","江苏奥立信数字科技有限公司",{"$f":"VLOOKUP(F36,[1]用友原始数据!B$1:B$65536,1,0)","v":"江苏奥立信数字科技有限公司"},"曾庆斌","18605314315","C2023247","中国物联网国际创新园/三期/G1栋/306","租金","2021年06月01日~2021年09月01日","入驻款（租金）",57004.5,"",0,57004.5,"待开账","已开账",null,"","否",null,null,"","hqGF1z8iFNwyJRuJwWb"]
["ptOioSEymCq9SkQ41E5","已开账","不收款","C2023247","2021年09月01日~2021年12月01日 租金","江苏奥立信数字科技有限公司",{"$f":"VLOOKUP(F37,[1]用友原始数据!B$1:B$65536,1,0)","v":"江苏奥立信数字科技有限公司"},"曾庆斌","18605314315","C2023247","中国物联网国际创新园/三期/G1栋/306","租金","2021年09月01日~2021年12月01日","2021年09月01日~2021年12月01日 租金",57004.5,"2021-08-24",0,57004.5,"待开账","已开账",null,"","否",null,null,"720","ptOioSEymCq9SkQ41E5"]
["uzCU8gHxAEE3vLRFTyU","已开账","不收款","C2023247","2021年12月01日~2022年03月01日 租金","江苏奥立信数字科技有限公司",{"$f":"VLOOKUP(F38,[1]用友原始数据!B$1:B$65536,1,0)","v":"江苏奥立信数字科技有限公司"},"曾庆斌","18605314315","C2023247","中国物联网国际创新园/三期/G1栋/306","租金","2021年12月01日~2022年03月01日","2021年12月01日~2022年03月01日 租金",57004.5,"2021-11-23",0,57004.5,"待开账","已开账",null,"","否",null,null,"629","uzCU8gHxAEE3vLRFTyU"]
["1vwtyTdlsXEWM9WkNgj","已开账","不收款","C2023247","2022年03月01日~2022年06月01日 租金","江苏奥立信数字科技有限公司",{"$f":"VLOOKUP(F39,[1]用友原始数据!B$1:B$65536,1,0)","v":"江苏奥立信数字科技有限公司"},"曾庆斌","18605314315","C2023247","中国物联网国际创新园/三期/G1栋/306","租金","2022年03月01日~2022年06月01日","2022年03月01日~2022年06月01日 租金",57004.5,"2022-02-21",0,57004.5,"待开账","已开账",null,"","否",null,null,"539","1vwtyTdlsXEWM9WkNgj"]
["UGhcuIxPqxUsoiOlRJe","已开账","不收款","C2023247","2022年06月01日~2022年09月01日 租金","江苏奥立信数字科技有限公司",{"$f":"VLOOKUP(F40,[1]用友原始数据!B$1:B$65536,1,0)","v":"江苏奥立信数字科技有限公司"},"曾庆斌","18605314315","C2023247","中国物联网国际创新园/三期/G1栋/306","租金","2022年06月01日~2022年09月01日","2022年06月01日~2022年09月01日 租金",57004.5,"2022-05-24",0,57004.5,"待开账","已开账",null,"","否",null,null,"447","UGhcuIxPqxUsoiOlRJe"]
["muXZXagd5pGpvvBIJkY","已开账","不收款","C2023247","2022年09月01日~2022年12月01日 租金","江苏奥立信数字科技有限公司",{"$f":"VLOOKUP(F41,[1]用友原始数据!B$1:B$65536,1,0)","v":"江苏奥立信数字科技有限公司"},"曾庆斌","18605314315","C2023247","中国物联网国际创新园/三期/G1栋/306","租金","2022年09月01日~2022年12月01日","2022年09月01日~2022年12月01日 租金",57004.5,"2022-08-24",0,57004.5,"待开账","已开账",null,"","否",null,null,"355","muXZXagd5pGpvvBIJkY"]
["L2pWZrXuvStTJgSxC3S","已开账","不收款","C2023247","2022年12月01日~2023年03月01日 租金","江苏奥立信数字科技有限公司",{"$f":"VLOOKUP(F42,[1]用友原始数据!B$1:B$65536,1,0)","v":"江苏奥立信数字科技有限公司"},"曾庆斌","18605314315","C2023247","中国物联网国际创新园/三期/G1栋/306","租金","2022年12月01日~2023年03月01日","2022年12月01日~2023年03月01日 租金",57004.5,"2022-11-23",0,57004.5,"待开账","已开账",null,"","否",null,null,"264","L2pWZrXuvStTJgSxC3S"]
["gunDpa1qw5EC0gX2Bvv","已开账","不收款","C2023247","2023年03月01日~2023年06月01日 租金","江苏奥立信数字科技有限公司",{"$f":"VLOOKUP(F43,[1]用友原始数据!B$1:B$65536,1,0)","v":"江苏奥立信数字科技有限公司"},"曾庆斌","18605314315","C2023247","中国物联网国际创新园/三期/G1栋/306","租金","2023年03月01日~2023年06月01日","2023年03月01日~2023年06月01日 租金",57004.5,"2023-02-21",0,57004.5,"待开账","已开账",null,"","否",null,null,"174","gunDpa1qw5EC0gX2Bvv"]
["oEpFoeslF96D3ao0nY4","已开账","不收款","C2023311","入驻款（物业费）","江苏晟能科技股份有限公司",{"$f":"VLOOKUP(F44,[1]用友原始数据!B$1:B$65536,1,0)","v":"江苏晟能科技股份有限公司"},"倪晓宇","13585085897","C2023311","中国物联网国际创新园/三期/G10栋/908","物业费","2021年01月01日~2021年04月01日","入驻款（物业费）",5775,"",0,5775,"待开账","已开账",null,"","否",null,null,"","oEpFoeslF96D3ao0nY4"]
["7MOjlNPgZdgbx4Gdsi0","已开账","不收款","C2023311","2021年04月01日~2021年07月01日 物业费","江苏晟能科技股份有限公司",{"$f":"VLOOKUP(F45,[1]用友原始数据!B$1:B$65536,1,0)","v":"江苏晟能科技股份有限公司"},"倪晓宇","13585085897","C2023311","中国物联网国际创新园/三期/G10栋/908","物业费","2021年04月01日~2021年07月01日","2021年04月01日~2021年07月01日 物业费",5775,"2021-03-24",0,5775,"待开账","已开账",null,"","否",null,null,"873","7MOjlNPgZdgbx4Gdsi0"]
["B5t4xXuQOAPOBaHUDjn","已开账","不收款","C2023311","2021年07月01日~2021年10月01日 物业费","江苏晟能科技股份有限公司",{"$f":"VLOOKUP(F46,[1]用友原始数据!B$1:B$65536,1,0)","v":"江苏晟能科技股份有限公司"},"倪晓宇","13585085897","C2023311","中国物联网国际创新园/三期/G10栋/908","物业费","2021年07月01日~2021年10月01日","2021年07月01日~2021年10月01日 物业费",5775,"2021-06-23",0,5775,"待开账","已开账",null,"","否",null,null,"782","B5t4xXuQOAPOBaHUDjn"]
["VDMOkGHBaqdk52NzIiX","已开账","不收款","C2023311","2021年10月01日~2022年01月01日 物业费","江苏晟能科技股份有限公司",{"$f":"VLOOKUP(F47,[1]用友原始数据!B$1:B$65536,1,0)","v":"江苏晟能科技股份有限公司"},"倪晓宇","13585085897","C2023311","中国物联网国际创新园/三期/G10栋/908","物业费","2021年10月01日~2022年01月01日","2021年10月01日~2022年01月01日 物业费",5775,"2021-09-23",0,5775,"待开账","已开账",null,"","否",null,null,"690","VDMOkGHBaqdk52NzIiX"]
["Y0K9oElv3omm185hJfZ","已开账","不收款","C2023311","2022年01月01日~2022年04月01日 物业费","江苏晟能科技股份有限公司",{"$f":"VLOOKUP(F48,[1]用友原始数据!B$1:B$65536,1,0)","v":"江苏晟能科技股份有限公司"},"倪晓宇","13585085897","C2023311","中国物联网国际创新园/三期/G10栋/908","物业费","2022年01月01日~2022年04月01日","2022年01月01日~2022年04月01日 物业费",5775,"2021-12-24",0,5775,"待开账","已开账",null,"","否",null,null,"598","Y0K9oElv3omm185hJfZ"]
["LRjM0nhUOVKjwFlHqEE","已开账","不收款","C2023311","2022年04月01日~2022年07月01日 物业费","江苏晟能科技股份有限公司",{"$f":"VLOOKUP(F49,[1]用友原始数据!B$1:B$65536,1,0)","v":"江苏晟能科技股份有限公司"},"倪晓宇","13585085897","C2023311","中国物联网国际创新园/三期/G10栋/908","物业费","2022年04月01日~2022年07月01日","2022年04月01日~2022年07月01日 物业费",5775,"2022-03-24",0,5775,"待开账","已开账",null,"","否",null,null,"508","LRjM0nhUOVKjwFlHqEE"]
["BrPzgh4Z3dzrIeHdxvG","已开账","不收款","C2023311","2022年07月01日~2022年10月01日 物业费","江苏晟能科技股份有限公司",{"$f":"VLOOKUP(F50,[1]用友原始数据!B$1:B$65536,1,0)","v":"江苏晟能科技股份有限公司"},"倪晓宇","13585085897","C2023311","中国物联网国际创新园/三期/G10栋/908","物业费","2022年07月01日~2022年10月01日","2022年07月01日~2022年10月01日 物业费",5775,"2022-06-23",0,5775,"待开账","已开账",null,"","否",null,null,"417","BrPzgh4Z3dzrIeHdxvG"]
["4GnXkiZMiBO0U0cp2cU","已开账","不收款","C2023311","2022年10月01日~2023年01月01日 物业费","江苏晟能科技股份有限公司",{"$f":"VLOOKUP(F51,[1]用友原始数据!B$1:B$65536,1,0)","v":"江苏晟能科技股份有限公司"},"倪晓宇","13585085897","C2023311","中国物联网国际创新园/三期/G10栋/908","物业费","2022年10月01日~2023年01月01日","2022年10月01日~2023年01月01日 物业费",5775,"2022-09-23",0,5775,"待开账","已开账",null,"","否",null,null,"325","4GnXkiZMiBO0U0cp2cU"]
["gvdsuunUXIAjNvWGji7","已开账","不收款","C2023311","2023年01月01日~2023年04月01日 物业费","江苏晟能科技股份有限公司",{"$f":"VLOOKUP(F52,[1]用友原始数据!B$1:B$65536,1,0)","v":"江苏晟能科技股份有限公司"},"倪晓宇","13585085897","C2023311","中国物联网国际创新园/三期/G10栋/908","物业费","2023年01月01日~2023年04月01日","2023年01月01日~2023年04月01日 物业费",5775,"2022-12-24",0,5775,"待开账","已开账",null,"","否",null,null,"233","gvdsuunUXIAjNvWGji7"]
["jeXzf6Kl5FNjTKzVIVQ","已开账","不收款","C2023311","入驻款（租金）","江苏晟能科技股份有限公司",{"$f":"VLOOKUP(F53,[1]用友原始数据!B$1:B$65536,1,0)","v":"江苏晟能科技股份有限公司"},"倪晓宇","13585085897","C2023311","中国物联网国际创新园/三期/G10栋/908","租金","2021年01月01日~2021年04月01日","入驻款（租金）",28875,"",0,28875,"待开账","已开账",null,"","否",null,null,"","jeXzf6Kl5FNjTKzVIVQ"]
["Gy4VtsHegj0n5LXkQQ4","已开账","不收款","C2023311","2021年04月01日~2021年07月01日 租金","江苏晟能科技股份有限公司",{"$f":"VLOOKUP(F54,[1]用友原始数据!B$1:B$65536,1,0)","v":"江苏晟能科技股份有限公司"},"倪晓宇","13585085897","C2023311","中国物联网国际创新园/三期/G10栋/908","租金","2021年04月01日~2021年07月01日","2021年04月01日~2021年07月01日 租金",28875,"2021-03-24",0,28875,"待开账","已开账",null,"","否",null,null,"873","Gy4VtsHegj0n5LXkQQ4"]
["Xt9mLhg1Hgt2YMbMCl1","已开账","不收款","C2023311","2021年07月01日~2021年10月01日 租金","江苏晟能科技股份有限公司",{"$f":"VLOOKUP(F55,[1]用友原始数据!B$1:B$65536,1,0)","v":"江苏晟能科技股份有限公司"},"倪晓宇","13585085897","C2023311","中国物联网国际创新园/三期/G10栋/908","租金","2021年07月01日~2021年10月01日","2021年07月01日~2021年10月01日 租金",28875,"2021-06-23",0,28875,"待开账","已开账",null,"","否",null,null,"782","Xt9mLhg1Hgt2YMbMCl1"]
["jZTALHN602HqzBkaDJI","已开账","不收款","C2023311","2021年10月01日~2022年01月01日 租金","江苏晟能科技股份有限公司",{"$f":"VLOOKUP(F56,[1]用友原始数据!B$1:B$65536,1,0)","v":"江苏晟能科技股份有限公司"},"倪晓宇","13585085897","C2023311","中国物联网国际创新园/三期/G10栋/908","租金","2021年10月01日~2022年01月01日","2021年10月01日~2022年01月01日 租金",28875,"2021-09-23",0,28875,"待开账","已开账",null,"","否",null,null,"690","jZTALHN602HqzBkaDJI"]
["3qbFyT4xBtRysajALH8","已开账","不收款","C2023311","2022年01月01日~2022年04月01日 租金","江苏晟能科技股份有限公司",{"$f":"VLOOKUP(F57,[1]用友原始数据!B$1:B$65536,1,0)","v":"江苏晟能科技股份有限公司"},"倪晓宇","13585085897","C2023311","中国物联网国际创新园/三期/G10栋/908","租金","2022年01月01日~2022年04月01日","2022年01月01日~2022年04月01日 租金",28875,"2021-12-24",0,28875,"待开账","已开账",null,"","否",null,null,"598","3qbFyT4xBtRysajALH8"]
["dmnLnZnpbwnFfKXbJyr","已开账","不收款","C2023311","2022年04月01日~2022年07月01日 租金","江苏晟能科技股份有限公司",{"$f":"VLOOKUP(F58,[1]用友原始数据!B$1:B$65536,1,0)","v":"江苏晟能科技股份有限公司"},"倪晓宇","13585085897","C2023311","中国物联网国际创新园/三期/G10栋/908","租金","2022年04月01日~2022年07月01日","2022年04月01日~2022年07月01日 租金",28875,"2022-03-24",0,28875,"待开账","已开账",null,"","否",null,null,"508","dmnLnZnpbwnFfKXbJyr"]
["UO2vcCpzdPbWntl1S27","已开账","不收款","C2023311","2022年07月01日~2022年10月01日 租金","江苏晟能科技股份有限公司",{"$f":"VLOOKUP(F59,[1]用友原始数据!B$1:B$65536,1,0)","v":"江苏晟能科技股份有限公司"},"倪晓宇","13585085897","C2023311","中国物联网国际创新园/三期/G10栋/908","租金","2022年07月01日~2022年10月01日","2022年07月01日~2022年10月01日 租金",28875,"2022-06-23",0,28875,"待开账","已开账",null,"","否",null,null,"417","UO2vcCpzdPbWntl1S27"]
["1Aa4ldVM9c8Q6HHEspA","已开账","不收款","C2023311","2022年10月01日~2023年01月01日 租金","江苏晟能科技股份有限公司",{"$f":"VLOOKUP(F60,[1]用友原始数据!B$1:B$65536,1,0)","v":"江苏晟能科技股份有限公司"},"倪晓宇","13585085897","C2023311","中国物联网国际创新园/三期/G10栋/908","租金","2022年10月01日~2023年01月01日","2022年10月01日~2023年01月01日 租金",28875,"2022-09-23",0,28875,"待开账","已开账",null,"","否",null,null,"325","1Aa4ldVM9c8Q6HHEspA"]
{"$rows_left_out":567}
{"sheet":"Sheet2","index":1,"n_rows":0,"n_cols":0,"rows_kept":0,"cut":false,"hidden":false,"merged":[]}

{"sheet":"Sheet3","index":2,"n_rows":0,"n_cols":0,"rows_kept":0,"cut":false,"hidden":false,"merged":[]}